{"text_format":"3","workbook":"xlsx","n_sheets":2,"sheets":["Sheet1","Sheet2"],"not_rendered":{"external_links":1},"read":"whole","date_system":"1900"}

{"sheet":"Sheet1","index":0,"n_rows":35,"n_cols":5,"rows_kept":35}
["准考证号","姓名","报考科目","理论成绩","实操成绩"]
["23S00003401004230191003782","管中玲","茶艺师（三级）",87,29]
["23S00003401004230278003783","刘琼琼","会展设计师（三级）",{"$f":"VLOOKUP(#REF!,[1]考生成绩表!$F:$O,10,FALSE)","v":{"$error":"#REF!"}},69]
["23S00003401004230278003784","黄俊","会展设计师（三级）",0,0]
["23S00003401004230278003785","程义润","会展设计师（三级）",{"$f":"VLOOKUP(#REF!,[1]考生成绩表!$F:$O,10,FALSE)","v":{"$error":"#REF!"}}]
["23S00003401004230278003786","陈世琴","会展设计师（三级）",79,77]
["23S00003401004230278003787","孙庆美","会展设计师（三级）",90,79]
["23S00003401004230278003788","孙勇军","会展设计师（三级）",{"$f":"VLOOKUP(#REF!,[1]考生成绩表!$F:$O,10,FALSE)","v":{"$error":"#REF!"}},82]
["23S00003401004230278003789","光瑶瑶","会展设计师（三级）",{"$f":"VLOOKUP(#REF!,[1]考生成绩表!$F:$O,10,FALSE)","v":{"$error":"#REF!"}},72]
["23S00003401004230278003790","王思斯","会展设计师（三级）",{"$f":"VLOOKUP(#REF!,[1]考生成绩表!$F:$O,10,FALSE)","v":{"$error":"#REF!"}},89]
["23S00003401004230278003791","张然","会展设计师（三级）",{"$f":"VLOOKUP(#REF!,[1]考生成绩表!$F:$O,10,FALSE)","v":{"$error":"#REF!"}},78]
["23S00003401004230278003792","彭小广","会展设计师（三级）",{"$f":"VLOOKUP(#REF!,[1]考生成绩表!$F:$O,10,FALSE)","v":{"$error":"#REF!"}},78]
["23S00003401004230278003793","杨之成","会展设计师（三级）",{"$f":"VLOOKUP(#REF!,[1]考生成绩表!$F:$O,10,FALSE)","v":{"$error":"#REF!"}},92]
["23S00003401004230381003794","程华安","广告设计师（三级）",94,79]
["23S00003401004230381003795","邢秋莉","广告设计师（三级）",67,78]
["23S00003401004240191003800","钟琴","茶艺师（四级）",78,77]
["23S00003401004240191003801","孙婷","茶艺师（四级）",100,70]
["23S00003401004240191003802","杨麟","茶艺师（四级）",91,64]
["23S00003401004240191003803","王婷","茶艺师（四级）",98,86]
["23S00003401004240191003804","刘玉玲","茶艺师（四级）",83,61]
["23S00003401004240191003805","吴昌鑫","茶艺师（四级）",87,84]
["23S00003401004240191003806","谭传芳","茶艺师（四级）",72,70]
["23S00003401004240191003807","田莹莹","茶艺师（四级）",97,73]
["23S00003401004240191003808","王容","茶艺师（四级）",88,70]
["23S00003401004240191003809","孟美玲","茶艺师（四级）",82,64]
["23S00003401004240191003810","于金凤","茶艺师（四级）",97,63]
["23S00003401004240191003811","张义","茶艺师（四级）",0,0]
["23S00003401004240191003822","程叶萍","茶艺师（四级）",93,60]
["23S00003401004240191003823","邓海娟","茶艺师（四级）",81,65]
["23S00003401004240278003824","闫佳慧","会展设计师（四级）",99,70]
["23S00003401004240278003825","陆静安","会展设计师（四级）",91,70]
["23S00003401004240901003796","陈子祥","评茶员（四级）",76,68]
["23S00003401004240901003797","丁升平","评茶员（四级）",79,62]
["23S00003401004240901003798","陈瑞娟","评茶员（四级）",71,64]
["23S00003401004240901003799","唐文婷","评茶员（四级）",77,61]

{"sheet":"Sheet2","index":1,"n_rows":3,"n_cols":1,"rows_kept":3,"hidden":true}
["正常考试"]
["缺考"]
["舞弊"]